{"text_format":"1","workbook":"xlsx","n_sheets":5,"sheets":["Programa","Grupos","Partidos","Tablas","Finales"],"not_rendered":{"charts":0,"images":0,"macros":1,"external_links":0,"defined_names":0,"comments":0,"pivot_tables":0},"unopened":[],"bounds":{"document_bytes":16777216,"sheet_cells":100000,"rows_first":2000,"rows_last":500,"rows_between":2000,"halvings":0,"cell_chars":16384,"cell_head_chars":4096},"cells_cut":0,"cells_raw":0,"read":"whole","date_system":"1900"}

{"sheet":"Programa","index":0,"n_rows":5,"n_cols":5,"rows_kept":5,"cut":false,"hidden":true,"merged":[[1,11,1,12],[1,1,1,2],[1,3,1,4],[1,5,1,6],[1,7,1,8],[1,9,1,10]]}
["Cantidad de equipos",null,null,4]
[null,"P 1",null,"P 2"]
["1 Fecha ",3,4,1,2]
["2 Fecha ",4,1,2,3]
["3 Fecha ",2,4,3,1]

{"sheet":"Grupos","index":1,"n_rows":33,"n_cols":12,"rows_kept":33,"cut":false,"hidden":false,"merged":[[0,4,0,11]]}
["ITEM","EQUIPOS",null,null,"TORNEO FASE DE GRUPOS - 32 EQUIPOS - 8 GRUPOS"]
[1,"Ajax"]
[2,"Arsenal"]
[3,"Benfica",null,null,"Grupo A","Grupo B","Grupo C","Grupo D","Grupo E","Grupo F","Grupo G","Grupo H"]
[4,"Barcelona",null,1,"Envigado","Deportivo Cali","Villarreal","Millonarios","Medellín","Boca Juniors","Ajax","Flamengo"]
[5,"Bayern Munich",null,2,"Inter de Milán","Oporto","Once Caldas","Juventus","Santa Fe","Real Madrid","Real Sociedad","Chelsea"]
[6,"Chelsea",null,3,"Cortuluá","Roma","Independiente","Manchester","Mónaco","River Plate","Bayern Munich","Arsenal"]
[7,"Colonia",null,4,"Gremio","Colonia","Benfica","América","Sao Paulo","Liverpool","Milán","Barcelona"]
[8,"Inter de Milán"]
[9,"Liverpool"]
[10,"Manchester"]
[11,"Mónaco"]
[12,"Real Madrid"]
[13,"Real Sociedad"]
[14,"Roma"]
[15,"Villarreal"]
[16,"Boca Juniors"]
[17,"Flamengo"]
[18,"Gremio"]
[19,"Independiente"]
[20,"Juventus"]
[21,"Milán"]
[22,"Oporto"]
[23,"River Plate"]
[24,"Sao Paulo"]
[25,"Deportivo Cali"]
[26,"Cortuluá"]
[27,"Medellín"]
[28,"Once Caldas"]
[29,"América"]
[30,"Millonarios"]
[31,"Santa Fe"]
[32,"Envigado"]

{"sheet":"Partidos","index":2,"n_rows":31,"n_cols":9,"rows_kept":31,"cut":false,"hidden":false,"merged":[[24,0,24,3],[24,5,24,8],[0,0,0,3],[0,5,0,8],[8,0,8,3],[8,5,8,8],[16,0,16,3],[16,5,16,8]]}
["Grupo A",null,null,null,null,"Grupo B"]
["Cortuluá",3,2,"Gremio",null,"Roma",3,4,"Colonia"]
["Envigado",4,5,"Inter de Milán",null,"Deportivo Cali",1,2,"Oporto"]
["Gremio",2,0,"Envigado",null,"Colonia",2,1,"Deportivo Cali"]
["Inter de Milán",1,2,"Cortuluá",null,"Oporto",1,2,"Roma"]
["Inter de Milán",2,3,"Gremio",null,"Oporto",2,1,"Colonia"]
["Cortuluá",1,0,"Envigado",null,"Roma",2,1,"Deportivo Cali"]
[]
["Grupo C",null,null,null,null,"Grupo D"]
["Independiente",3,3,"Benfica",null,"Manchester",3,2,"América"]
["Villarreal",1,4,"Once Caldas",null,"Millonarios",1,2,"Juventus"]
["Benfica",2,2,"Villarreal",null,"América",2,2,"Millonarios"]
["Once Caldas",1,1,"Independiente",null,"Juventus",1,2,"Manchester"]
["Once Caldas",2,2,"Benfica",null,"Juventus",2,3,"América"]
["Independiente",2,1,"Villarreal",null,"Manchester",2,2,"Millonarios"]
[]
["Grupo E",null,null,null,null,"Grupo F"]
["Mónaco",2,3,"Sao Paulo",null,"River Plate",3,1,"Liverpool"]
["Medellín",2,4,"Santa Fe",null,"Boca Juniors",1,2,"Real Madrid"]
["Sao Paulo",0,2,"Medellín",null,"Liverpool",2,1,"Boca Juniors"]
["Santa Fe",0,1,"Mónaco",null,"Real Madrid",1,1,"River Plate"]
["Santa Fe",0,2,"Sao Paulo",null,"Real Madrid",2,2,"Liverpool"]
["Mónaco",0,1,"Medellín",null,"River Plate",2,1,"Boca Juniors"]
[]
["Grupo G",null,null,null,null,"Grupo H"]
["Bayern Munich",3,1,"Milán",null,"Arsenal",3,3,"Barcelona"]
["Ajax",4,1,"Real Sociedad",null,"Flamengo",1,4,"Chelsea"]
["Milán",2,2,"Ajax",null,"Barcelona",2,2,"Flamengo"]
["Real Sociedad",1,1,"Bayern Munich",null,"Chelsea",1,2,"Arsenal"]
["Real Sociedad",2,1,"Milán",null,"Chelsea",2,2,"Barcelona"]
["Bayern Munich",1,1,"Ajax",null,"Arsenal",2,1,"Flamengo"]

{"sheet":"Tablas","index":3,"n_rows":55,"n_cols":10,"rows_kept":55,"cut":false,"hidden":false,"merged":[[0,0,0,9],[42,0,42,9],[49,0,49,9],[7,0,7,9],[14,0,14,9],[21,0,21,9],[28,0,28,9],[35,0,35,9]]}
["Grupo A"]
["Pos","Equipo","PJ","PG","PE","PP","GF","GC","DG","PTS"]
[1,"Cortuluá",3,3,0,0,6,3,3,9]
[2,"Gremio",3,2,0,1,7,5,2,6]
[3,"Inter de Milán",3,1,0,2,8,9,-1,3]
[4,"Envigado",3,0,0,3,4,8,-4,0]
[]
["Grupo B"]
["Pos","Equipo","PJ","PG","PE","PP","GF","GC","DG","PTS"]
[1,"Roma",3,2,0,1,7,6,1,6]
[2,"Colonia",3,2,0,1,7,6,1,6]
[3,"Oporto",3,2,0,1,5,4,1,6]
[4,"Deportivo Cali",3,0,0,3,3,6,-3,0]
[]
["Grupo C"]
["Pos","Equipo","PJ","PG","PE","PP","GF","GC","DG","PTS"]
[1,"Once Caldas",3,1,2,0,7,4,3,5]
[2,"Independiente",3,1,2,0,6,5,1,5]
[3,"Benfica",3,0,3,0,7,7,0,3]
[4,"Villarreal",3,0,1,2,4,8,-4,1]
[]
["Grupo D"]
["Pos","Equipo","PJ","PG","PE","PP","GF","GC","DG","PTS"]
[1,"Manchester",3,2,1,0,7,5,2,7]
[2,"América",3,1,1,1,7,7,0,4]
[3,"Juventus",3,1,0,2,5,6,-1,3]
[4,"Millonarios",3,0,2,1,5,6,-1,2]
[]
["Grupo E"]
["Pos","Equipo","PJ","PG","PE","PP","GF","GC","DG","PTS"]
[1,"Medellín",3,2,0,1,5,4,1,6]
[2,"Sao Paulo",3,2,0,1,5,4,1,6]
[3,"Santa Fe",3,1,0,2,4,5,-1,3]
[4,"Mónaco",3,1,0,2,3,4,-1,3]
[]
["Grupo F"]
["Pos","Equipo","PJ","PG","PE","PP","GF","GC","DG","PTS"]
[1,"River Plate",3,2,1,0,6,3,3,7]
[2,"Real Madrid",3,1,2,0,5,4,1,5]
[3,"Liverpool",3,1,1,1,5,6,-1,4]
[4,"Boca Juniors",3,0,0,3,3,6,-3,0]
[]
["Grupo G"]
["Pos","Equipo","PJ","PG","PE","PP","GF","GC","DG","PTS"]
[1,"Ajax",3,1,2,0,7,4,3,5]
[2,"Bayern Munich",3,1,2,0,5,3,2,5]
[3,"Real Sociedad",3,1,1,1,4,6,-2,4]
[4,"Milán",3,0,1,2,4,7,-3,1]
[]
["Grupo H"]
["Pos","Equipo","PJ","PG","PE","PP","GF","GC","DG","PTS"]
[1,"Arsenal",3,2,1,0,7,5,2,7]
[2,"Chelsea",3,1,1,1,7,5,2,4]
[3,"Barcelona",3,0,3,0,7,7,0,3]
[4,"Flamengo",3,0,1,2,4,8,-4,1]

{"sheet":"Finales","index":4,"n_rows":22,"n_cols":21,"rows_kept":22,"cut":false,"hidden":false,"merged":[[13,9,13,12],[11,9,11,12],[14,9,14,12],[10,9,10,12],[8,9,8,12]]}
[]
[null,"1-A","Cortuluá",2,null,null,null,null,null,null,null,null,null,null,null,null,null,null,2,"Arsenal","1-H"]
[null,null,null,null,null,{"$f":"IF(OR(D2=\"\",D4=\"\"),\"\",IF(D2>D4,C2,C4))","v":"Colonia"},3,null,null,null,null,null,null,null,null,2,{"$f":"IF(OR(S2=\"\",S4=\"\"),\"\",IF(S2>S4,T2,T4))","v":"Bayern Munich"}]
[null,"2-B","Colonia",3,null,null,null,null,null,null,null,null,null,null,null,null,null,null,3,"Bayern Munich","2-G"]
[]
[null,null,null,null,null,null,null,{"$f":"IF(OR(G3=\"\",G9=\"\"),\"\",IF(G3>G9,F3,F9))","v":"Colonia"},3,null,null,null,null,3,{"$f":"IF(OR(P3=\"\",P9=\"\"),\"\",IF(P3>P9,Q3,Q9))","v":"Ajax"}]
[]
[null,"1-B","Roma",1,null,null,null,null,null,null,null,null,null,null,null,null,null,null,2,"Ajax","1-G"]
[null,null,null,null,null,{"$f":"IF(OR(D8=\"\",D10=\"\"),\"\",IF(D8>D10,C8,C10))","v":"Gremio"},2,null,null,"FINAL",null,null,null,null,null,3,{"$f":"IF(OR(S8=\"\",S10=\"\"),\"\",IF(S8>S10,T8,T10))","v":"Ajax"}]
[null,"2-A","Gremio",2,null,null,null,null,null,{"$f":"IF(OR(I6=\"\",I18=\"\"),\"\",IF(I6>I18,H6,H18))","v":"Colonia"},null,null,{"$f":"IF(OR(N6=\"\",N18=\"\"),\"\",IF(N6>N18,O6,O18))","v":"Ajax"},null,null,null,null,null,1,"Chelsea","2-H"]
[null,null,null,null,null,null,null,null,null,"CAMPEON"]
[null,null,null,null,null,null,null,null,null,{"$f":"IF(OR(K10=\"\",L10=\"\"),\"\",IF(K10>L10,J10,M10))","v":""}]
[]
[null,"1-C","Once Caldas",3,null,null,null,null,null,"SUB - CAMPEON",null,null,null,null,null,null,null,null,4,"River Plate","1-F"]
[null,null,null,null,null,{"$f":"IF(OR(D14=\"\",D16=\"\"),\"\",IF(D14>D16,C14,C16))","v":"Once Caldas"},1,null,null,{"$f":"IF(J12=\"\",\"\",IF(J12=J10,M10,J10))","v":""},null,null,null,null,null,2,{"$f":"IF(OR(S14=\"\",S16=\"\"),\"\",IF(S14>S16,T14,T16))","v":"River Plate"}]
[null,"2-D","América",2,null,null,null,null,null,null,null,null,null,null,null,null,null,null,3,"Sao Paulo","2-E"]
[]
[null,null,null,null,null,null,null,{"$f":"IF(OR(G15=\"\",G21=\"\"),\"\",IF(G15>G21,F15,F21))","v":"Independiente"},2,null,null,null,null,1,{"$f":"IF(OR(P15=\"\",P21=\"\"),\"\",IF(P15>P21,Q15,Q21))","v":"River Plate"}]
[]
[null,"1-D","Manchester",1,null,null,null,null,null,null,null,null,null,null,null,null,null,null,2,"Medellín","1-E"]
[null,null,null,null,null,{"$f":"IF(OR(D20=\"\",D22=\"\"),\"\",IF(D20>D22,C20,C22))","v":"Independiente"},2,null,null,null,null,null,null,null,null,1,{"$f":"IF(OR(S20=\"\",S22=\"\"),\"\",IF(S20>S22,T20,T22))","v":"Medellín"}]
[null,"2-C","Independiente",2,null,null,null,null,null,null,null,null,null,null,null,null,null,null,1,"Real Madrid","2-F"]